Reaction Details
TargetCyclin-dependent kinase 2
LigandBDBM50332487
Substrate/Competitorn/a
Meas. Tech.ChEMBL_695082 (CHEMBL1640699)
IC50 850±n/a nM
Citation Mahboobi, SSellmer, AWinkler, MEichhorn, EPongratz, HCiossek, TBaer, TMaier, TBeckers, T Novel chimeric histone deacetylase inhibitors: a series of lapatinib hybrides as potent inhibitors of epidermal growth factor receptor (EGFR), human epidermal growth factor receptor 2 (HER2), and histone deacetylase activity. J Med Chem53:8546-55 (2010) 
 
Cyclin-dependent kinase 2
Name:Cyclin-dependent kinase 2
Type:Enzyme Subunit
Mol. Mass.:33938.17
Organism:Homo sapiens (Human)
Description:P24941
Residue:298
BDBM50332487
NameBDBM50332487
Synonyms:(E)-N-(2-aminophenyl)-3-(3-(4-(3-chloro-4-(3-fluorobenzyloxy)phenylamino)quinazolin-6-yl)phenyl)acrylamide | CHEMBL1630114
TypeSmall organic molecule
Emp. Form.C36H27ClFN5O2
Mol. Mass.616.083
SMILESNc1ccccc1NC(=O)\C=C\c1cccc(c1)-c1ccc2ncnc(Nc3ccc(OCc4cccc(F)c4)c(Cl)c3)c2c1