Reaction Details
TargetHistone deacetylase 1
LigandBDBM50332494
Substrate/Competitorn/a
Meas. Tech.ChEMBL_695073 (CHEMBL1640690)
IC50 35±n/a nM
Citation Mahboobi, SSellmer, AWinkler, MEichhorn, EPongratz, HCiossek, TBaer, TMaier, TBeckers, T Novel chimeric histone deacetylase inhibitors: a series of lapatinib hybrides as potent inhibitors of epidermal growth factor receptor (EGFR), human epidermal growth factor receptor 2 (HER2), and histone deacetylase activity. J Med Chem53:8546-55 (2010) 
 
Histone deacetylase 1
Name:Histone deacetylase 1
Type:Enzyme
Mol. Mass.:55090.27
Organism:Homo sapiens (Human)
Description:Q13547
Residue:482
BDBM50332494
NameBDBM50332494
Synonyms:(E)-3-{3-[4-(3-Chloro-4-(3-fluorobenzyloxy)phenylamino)quinazolin-6-yl)phenyl)-N-hydroxyacrylamide | CHEMBL1630109
TypeSmall organic molecule
Emp. Form.C30H22ClFN4O3
Mol. Mass.540.972
SMILESONC(=O)\C=C\c1cccc(c1)-c1ccc2ncnc(Nc3ccc(OCc4cccc(F)c4)c(Cl)c3)c2c1