Reaction Details
TargetSerine/threonine-protein kinase PLK1
LigandBDBM50332489
Substrate/Competitorn/a
Meas. Tech.ChEMBL_695084 (CHEMBL1640701)
IC50 27000±n/a nM
Citation Mahboobi, SSellmer, AWinkler, MEichhorn, EPongratz, HCiossek, TBaer, TMaier, TBeckers, T Novel chimeric histone deacetylase inhibitors: a series of lapatinib hybrides as potent inhibitors of epidermal growth factor receptor (EGFR), human epidermal growth factor receptor 2 (HER2), and histone deacetylase activity. J Med Chem53:8546-55 (2010) 
 
Serine/threonine-protein kinase PLK1
Name:Serine/threonine-protein kinase PLK1
Type:Serine/threonine-protein kinase
Mol. Mass.:68277.16
Organism:Homo sapiens (Human)
Description:P53350
Residue:603
BDBM50332489
NameBDBM50332489
Synonyms:CHEMBL1630116 | N-(2-aminophenyl)-3-(4-(4-(3-chloro-4-(3-fluorobenzyloxy)phenylamino)quinazolin-6-yl)phenyl)propanamide
TypeSmall organic molecule
Emp. Form.C36H29ClFN5O2
Mol. Mass.618.099
SMILESNc1ccccc1NC(=O)CCc1ccc(cc1)-c1ccc2ncnc(Nc3ccc(OCc4cccc(F)c4)c(Cl)c3)c2c1