Reaction Details
TargetSerine/threonine-protein kinase PLK1
LigandBDBM50332490
Substrate/Competitorn/a
Meas. Tech.ChEMBL_695084 (CHEMBL1640701)
IC50 2000±n/a nM
Citation Mahboobi, SSellmer, AWinkler, MEichhorn, EPongratz, HCiossek, TBaer, TMaier, TBeckers, T Novel chimeric histone deacetylase inhibitors: a series of lapatinib hybrides as potent inhibitors of epidermal growth factor receptor (EGFR), human epidermal growth factor receptor 2 (HER2), and histone deacetylase activity. J Med Chem53:8546-55 (2010) 
 
Serine/threonine-protein kinase PLK1
Name:Serine/threonine-protein kinase PLK1
Type:Serine/threonine-protein kinase
Mol. Mass.:68277.16
Organism:Homo sapiens (Human)
Description:P53350
Residue:603
BDBM50332490
NameBDBM50332490
Synonyms:5-(4-(3-chloro-4-(3-fluorobenzyloxy)phenylamino)quinazolin-6-yl)-N-hydroxyfuran-2-carboxamide | CHEMBL1630117
TypeSmall organic molecule
Emp. Form.C26H18ClFN4O4
Mol. Mass.504.897
SMILESONC(=O)c1ccc(o1)-c1ccc2ncnc(Nc3ccc(OCc4cccc(F)c4)c(Cl)c3)c2c1