Reaction Details
TargetGlycogen synthase kinase-3 beta
LigandBDBM50332519
Substrate/Competitorn/a
Meas. Tech.ChEMBL_695103 (CHEMBL1640851)
IC50 53±n/a nM
Citation Khanfar, MAHill, RAKaddoumi, AEl Sayed, KA Discovery of novel GSK-3ß inhibitors with potent in vitro and in vivo activities and excellent brain permeability using combined ligand- and structure-based virtual screening. J Med Chem53:8534-45 (2010) 
 
Glycogen synthase kinase-3 beta
Name:Glycogen synthase kinase-3 beta
Type:Enzyme
Mol. Mass.:46756.38
Organism:Homo sapiens (Human)
Description:P49841
Residue:420
BDBM50332519
NameBDBM50332519
Synonyms:CHEMBL1630483 | N-(4-Methoxyphenyl)-5-(4-(trifluoromethyl)phenyl)-1,3,4-oxadiazol-2-amine
TypeSmall organic molecule
Emp. Form.C16H12F3N3O2
Mol. Mass.335.2806
SMILESCOc1ccc(Nc2nnc(o2)-c2ccc(cc2)C(F)(F)F)cc1