Reaction Details
TargetGlycogen synthase kinase-3 beta
LigandBDBM50332524
Substrate/Competitorn/a
Meas. Tech.ChEMBL_695103 (CHEMBL1640851)
IC50 18±n/a nM
Citation Khanfar, MAHill, RAKaddoumi, AEl Sayed, KA Discovery of novel GSK-3ß inhibitors with potent in vitro and in vivo activities and excellent brain permeability using combined ligand- and structure-based virtual screening. J Med Chem53:8534-45 (2010) 
 
Glycogen synthase kinase-3 beta
Name:Glycogen synthase kinase-3 beta
Type:Enzyme
Mol. Mass.:46756.38
Organism:Homo sapiens (Human)
Description:P49841
Residue:420
BDBM50332524
NameBDBM50332524
Synonyms:4-(5-(4-methoxyphenylamino)-1,3,4-oxadiazol-2-yl)benzonitrile | CHEMBL1630487
TypeSmall organic molecule
Emp. Form.C16H12N4O2
Mol. Mass.292.2921
SMILESCOc1ccc(Nc2nnc(o2)-c2ccc(cc2)C#N)cc1