Reaction Details
TargetGlycogen synthase kinase-3 beta
LigandBDBM50332533
Substrate/Competitorn/a
Meas. Tech.ChEMBL_695103 (CHEMBL1640851)
IC50 263±n/a nM
Citation Khanfar, MAHill, RAKaddoumi, AEl Sayed, KA Discovery of novel GSK-3ß inhibitors with potent in vitro and in vivo activities and excellent brain permeability using combined ligand- and structure-based virtual screening. J Med Chem53:8534-45 (2010) 
 
Glycogen synthase kinase-3 beta
Name:Glycogen synthase kinase-3 beta
Type:Enzyme
Mol. Mass.:46756.38
Organism:Homo sapiens (Human)
Description:P49841
Residue:420
BDBM50332533
NameBDBM50332533
Synonyms:(Z)-3,3'-(4-((4-oxo-2-thioxothiazolidin-5-ylidene)methyl)phenylazanediyl)-dipropanoic acid | CHEMBL1630445
TypeSmall organic molecule
Emp. Form.C16H16N2O5S2
Mol. Mass.380.439
SMILESOC(=O)CCN(CCC(O)=O)c1ccc(C=C2SC(S)=NC2=O)cc1