Reaction Details
TargetGlycogen synthase kinase-3 beta
LigandBDBM50332534
Substrate/Competitorn/a
Meas. Tech.ChEMBL_695103 (CHEMBL1640851)
IC50 113±n/a nM
Citation Khanfar, MAHill, RAKaddoumi, AEl Sayed, KA Discovery of novel GSK-3ß inhibitors with potent in vitro and in vivo activities and excellent brain permeability using combined ligand- and structure-based virtual screening. J Med Chem53:8534-45 (2010) 
 
Glycogen synthase kinase-3 beta
Name:Glycogen synthase kinase-3 beta
Type:Enzyme
Mol. Mass.:46756.38
Organism:Homo sapiens (Human)
Description:P49841
Residue:420
BDBM50332534
NameBDBM50332534
Synonyms:2-(4-amino-5-(4-hydroxy-3-methoxyphenyl)pyrido[2,3-d]pyrimidin-7-yl)-6-chloro-4-methylphenol | CHEMBL1630446
TypeSmall organic molecule
Emp. Form.C21H17ClN4O3
Mol. Mass.408.838
SMILESCOc1cc(ccc1O)-c1cc(nc2ncnc(N)c12)-c1cc(C)cc(Cl)c1O