Reaction Details
TargetGlycogen synthase kinase-3 beta
LigandBDBM50332540
Substrate/Competitorn/a
Meas. Tech.ChEMBL_695103 (CHEMBL1640851)
IC50 138±n/a nM
Citation Khanfar, MAHill, RAKaddoumi, AEl Sayed, KA Discovery of novel GSK-3ß inhibitors with potent in vitro and in vivo activities and excellent brain permeability using combined ligand- and structure-based virtual screening. J Med Chem53:8534-45 (2010) 
 
Glycogen synthase kinase-3 beta
Name:Glycogen synthase kinase-3 beta
Type:Enzyme
Mol. Mass.:46756.38
Organism:Homo sapiens (Human)
Description:P49841
Residue:420
BDBM50332540
NameBDBM50332540
Synonyms:(Z)-5-(2,3-methylenedioxyphenyl)imidazolidine-2,4-dione CHEMBL1288549
TypeSmall organic molecule
Emp. Form.C11H8N2O4
Mol. Mass.232.1922
SMILESO=C1NC(=O)\C(N1)=C\c1cccc2OCOc12