Reaction Details
TargetSodium channel protein type 9 subunit alpha
LigandBDBM50325762
Substrate/Competitorn/a
Meas. Tech.ChEMBL_697999 (CHEMBL1633059)
Ki 340±n/a nM
Citation Tyagarajan, SChakravarty, PKZhou, BTaylor, BEid, RFisher, MHParsons, WHWyvratt, MJLyons, KAKlatt, TLi, XKumar, SWilliams, BFelix, JPriest, BTBrochu, RMWarren, VSmith, MGarcia, MKaczorowski, GJMartin, WJAbbadie, CMcGowan, EJochnowitz, NWeber, ADuffy, JL Discovery of a novel class of biphenyl pyrazole sodium channel blockers for treatment of neuropathic pain. Bioorg Med Chem Lett20:7479-82 (2010) 
 
Sodium channel protein type 9 subunit alpha
Name:Sodium channel protein type 9 subunit alpha
Type:Protein
Mol. Mass.:226375.97
Organism:Homo sapiens (Human)
Description:Q15858
Residue:1988
BDBM50325762
NameBDBM50325762
Synonyms:1-(2',4'-bis(trifluoromethyl)biphenyl-3-yl)-5-methyl-1H-pyrazole-3-carboxamide | CHEMBL1224194
TypeSmall organic molecule
Emp. Form.C19H13F6N3O
Mol. Mass.413.3164
SMILESCc1cc(nn1-c1cccc(c1)-c1ccc(cc1C(F)(F)F)C(F)(F)F)C(N)=O