Reaction Details
TargetOxytocin receptor
LigandBDBM50291330
Substrate/Competitorn/a
Meas. Tech.ChEMBL_697994 (CHEMBL1633054)
Ki 12±n/a nM
Citation Muttenthaler, MAndersson, Ade Araujo, ADDekan, ZLewis, RJAlewood, PF Modulating oxytocin activity and plasma stability by disulfide bond engineering. J Med Chem53:8585-96 (2010) 
 
Oxytocin receptor
Name:Oxytocin receptor
Type:Enzyme Catalytic Domain
Mol. Mass.:42793.26
Organism:Homo sapiens (Human)
Description:Oxytocin OXTR HEK293::B2R9L7
Residue:389
BDBM50291330
NameBDBM50291330
Synonyms:1-[19-Amino-13-benzyl-10-(2-carbamoyl-ethyl)-7-carbamoylmethyl-16-(4-hydroxy-benzyl)-6,9,12,15,18-pentaoxo-1,2-dithia-5,8,11,14,17-pentaaza-cycloicosane-4-carbonyl]-pyrrolidine-2-carboxylic acid [1-(carbamoylmethyl-carbamoyl)-4-guanidino-butyl]-amide AVP (Arginine-vasopressin ) CHEMBL264048 cyclo[Cys-Tyr-Phe-Gln-Asn-Cys]-Pro-Arg-Gly-NH2
TypeSmall organic molecule
Emp. Form.C46H65N15O12S2
Mol. Mass.1084.232
SMILESN[C@@H]1CSSC[C@H](NC(=O)[C@H](CC(N)=O)NC(=O)[C@@H](CCC(N)=O)NC(=O)[C@H](Cc2ccccc2)NC(=O)[C@@H](Cc2ccc(O)cc2)NC1=O)C(=O)N1CCC[C@@H]1C(=O)N[C@@H](CCCNC(N)=N)C(=O)NCC(N)=O