Reaction Details
TargetNeuronal acetylcholine receptor subunit alpha-7
LigandBDBM50035398
Substrate/Competitorn/a
Meas. Tech.ChEMBL_696893 (CHEMBL1639409)
Ki 1200±n/a nM
Citation Dallanoce, CMagrone, PMatera, CLo Presti, LDe Amici, MRiganti, LClementi, FGotti, CDe Micheli, C Synthesis of novel chiral¿2-isoxazoline derivatives related to ABT-418 and estimation of their affinity at neuronal nicotinic acetylcholine receptor subtypes. Eur J Med Chem45:5594-601 (2010) 
 
Neuronal acetylcholine receptor subunit alpha-7
Name:Neuronal acetylcholine receptor subunit alpha-7
Type:Enzyme
Mol. Mass.:56502.44
Organism:Rattus norvegicus (Rat)
Description:Q05941
Residue:502
BDBM50035398
NameBDBM50035398
Synonyms:(S)-1-Methyl-2-(3-methyl-isoxazol-5-yl)-pyrrolidinium 3-Methyl-5-((S)-1-methyl-pyrrolidin-2-yl)-isoxazole CHEMBL274525
TypeSmall organic molecule
Emp. Form.C9H14N2O
Mol. Mass.166.2203
SMILESCN1CCC[C@H]1c1cc(C)no1