Reaction Details
TargetCannabinoid receptor 1
LigandBDBM50332887
Substrate/Competitorn/a
Meas. Tech.ChEMBL_694005 (CHEMBL1636581)
Ki 47.6±n/a nM
Citation Silvestri, RLigresti, ALa Regina, GPiscitelli, FGatti, VLavecchia, ABrizzi, APasquini, SAllarà, MFantini, NCarai, MABigogno, CRozio, MGSinisi, RNovellino, EColombo, GDi Marzo, VDondio, GCorelli, F Synthesis and biological evaluation of new N-alkyl 1-aryl-5-(1H-pyrrol-1-yl)-1H-pyrazole-3-carboxamides as cannabinoid receptor ligands. Eur J Med Chem45:5878-86 (2010) 
 
Cannabinoid receptor 1
Name:Cannabinoid receptor 1
Type:G Protein-Coupled Receptor (GPCR)
Mol. Mass.:52868.96
Organism:Homo sapiens (Human)
Description:P21554
Residue:472
BDBM50332887
NameBDBM50332887
Synonyms:1-(2,4-Dichlorophenyl)-4-methyl-N-tert-pentyl-5-(1H-pyrrol-1-yl)-1H-pyrazole-3-carboxamide | CHEMBL1629731
TypeSmall organic molecule
Emp. Form.C20H22Cl2N4O
Mol. Mass.405.321
SMILESCCC(C)(C)NC(=O)c1nn(c(c1C)-n1cccc1)-c1ccc(Cl)cc1Cl