Reaction Details
TargetCannabinoid receptor 1
LigandBDBM50332892
Substrate/Competitorn/a
Meas. Tech.ChEMBL_694005 (CHEMBL1636581)
Ki 193.5±n/a nM
Citation Silvestri, RLigresti, ALa Regina, GPiscitelli, FGatti, VLavecchia, ABrizzi, APasquini, SAllarà, MFantini, NCarai, MABigogno, CRozio, MGSinisi, RNovellino, EColombo, GDi Marzo, VDondio, GCorelli, F Synthesis and biological evaluation of new N-alkyl 1-aryl-5-(1H-pyrrol-1-yl)-1H-pyrazole-3-carboxamides as cannabinoid receptor ligands. Eur J Med Chem45:5878-86 (2010) 
 
Cannabinoid receptor 1
Name:Cannabinoid receptor 1
Type:G Protein-Coupled Receptor (GPCR)
Mol. Mass.:52868.96
Organism:Homo sapiens (Human)
Description:P21554
Residue:472
BDBM50332892
NameBDBM50332892
Synonyms:1-(2,4-Dichlorophenyl)-5-(2,5-dimethyl-1H-pyrrol-1-yl)-4-methyl-N-tert-pentyl-1H-pyrazole-3-carboxamide | CHEMBL1631298
TypeSmall organic molecule
Emp. Form.C22H26Cl2N4O
Mol. Mass.433.374
SMILESCCC(C)(C)NC(=O)c1nn(c(c1C)-n1c(C)ccc1C)-c1ccc(Cl)cc1Cl