Reaction Details
TargetCannabinoid receptor 2
LigandBDBM50332872
Substrate/Competitorn/a
Meas. Tech.ChEMBL_694006 (CHEMBL1636582)
Ki 1496.2±n/a nM
Citation Silvestri, RLigresti, ALa Regina, GPiscitelli, FGatti, VLavecchia, ABrizzi, APasquini, SAllarà, MFantini, NCarai, MABigogno, CRozio, MGSinisi, RNovellino, EColombo, GDi Marzo, VDondio, GCorelli, F Synthesis and biological evaluation of new N-alkyl 1-aryl-5-(1H-pyrrol-1-yl)-1H-pyrazole-3-carboxamides as cannabinoid receptor ligands. Eur J Med Chem45:5878-86 (2010) 
 
Cannabinoid receptor 2
Name:Cannabinoid receptor 2
Type:G Protein-Coupled Receptor (GPCR)
Mol. Mass.:39690.94
Organism:Homo sapiens (Human)
Description:P34972
Residue:360
BDBM50332872
NameBDBM50332872
Synonyms:1-(2,4-Dichlorophenyl)-4-methyl-N-propyl-5-(1H-pyrrol-1-yl)-1H-pyrazole-3-carboxamide | CHEMBL1631160
TypeSmall organic molecule
Emp. Form.C18H18Cl2N4O
Mol. Mass.377.268
SMILESCCCNC(=O)c1nn(c(c1C)-n1cccc1)-c1ccc(Cl)cc1Cl