Reaction Details
TargetCannabinoid receptor 2
LigandBDBM50332875
Substrate/Competitorn/a
Meas. Tech.ChEMBL_694006 (CHEMBL1636582)
Ki 2344.4±n/a nM
Citation Silvestri, RLigresti, ALa Regina, GPiscitelli, FGatti, VLavecchia, ABrizzi, APasquini, SAllarà, MFantini, NCarai, MABigogno, CRozio, MGSinisi, RNovellino, EColombo, GDi Marzo, VDondio, GCorelli, F Synthesis and biological evaluation of new N-alkyl 1-aryl-5-(1H-pyrrol-1-yl)-1H-pyrazole-3-carboxamides as cannabinoid receptor ligands. Eur J Med Chem45:5878-86 (2010) 
 
Cannabinoid receptor 2
Name:Cannabinoid receptor 2
Type:G Protein-Coupled Receptor (GPCR)
Mol. Mass.:39690.94
Organism:Homo sapiens (Human)
Description:P34972
Residue:360
BDBM50332875
NameBDBM50332875
Synonyms:1-(2,4-Dichlorophenyl)-N-(5-hydroxypentyl)-4-methyl-5-(1Hpyrrol-1-yl)-1H-pyrazole-3-carboxamide | CHEMBL1631163
TypeSmall organic molecule
Emp. Form.C20H22Cl2N4O2
Mol. Mass.421.32
SMILESCc1c(nn(c1-n1cccc1)-c1ccc(Cl)cc1Cl)C(=O)NCCCCCO