Reaction Details
TargetCannabinoid receptor 2
LigandBDBM50332876
Substrate/Competitorn/a
Meas. Tech.ChEMBL_694006 (CHEMBL1636582)
Ki 383.3±n/a nM
Citation Silvestri, RLigresti, ALa Regina, GPiscitelli, FGatti, VLavecchia, ABrizzi, APasquini, SAllarà, MFantini, NCarai, MABigogno, CRozio, MGSinisi, RNovellino, EColombo, GDi Marzo, VDondio, GCorelli, F Synthesis and biological evaluation of new N-alkyl 1-aryl-5-(1H-pyrrol-1-yl)-1H-pyrazole-3-carboxamides as cannabinoid receptor ligands. Eur J Med Chem45:5878-86 (2010) 
 
Cannabinoid receptor 2
Name:Cannabinoid receptor 2
Type:G Protein-Coupled Receptor (GPCR)
Mol. Mass.:39690.94
Organism:Homo sapiens (Human)
Description:P34972
Residue:360
BDBM50332876
NameBDBM50332876
Synonyms:1-(2,4-Dichlorophenyl)-N-hexyl-4-methyl-5-(1H-pyrrol-1-yl)-1H-pyrazole-3-carboxamide | CHEMBL1631164
TypeSmall organic molecule
Emp. Form.C21H24Cl2N4O
Mol. Mass.419.347
SMILESCCCCCCNC(=O)c1nn(c(c1C)-n1cccc1)-c1ccc(Cl)cc1Cl