Reaction Details
TargetEctonucleotide pyrophosphatase/phosphodiesterase family member 2
LigandBDBM50332901
Substrate/Competitorn/a
Meas. Tech.ChEMBL_694283 (CHEMBL1637645)
Ki 27000±n/a nM
Citation East, JEKennedy, AJTomsig, JLDe Leon, ARLynch, KRMacdonald, TL Synthesis and structure-activity relationships of tyrosine-based inhibitors of autotaxin (ATX). Bioorg Med Chem Lett20:7132-6 (2010) 
 
Ectonucleotide pyrophosphatase/phosphodiesterase family member 2
Name:Ectonucleotide pyrophosphatase/phosphodiesterase family member 2
Type:Enzyme
Mol. Mass.:99007.13
Organism:Homo sapiens (Human)
Description:Q13822
Residue:863
BDBM50332901
NameBDBM50332901
Synonyms:CHEMBL1632523 anti-(3S)-4-(4-(benzyloxy)phenyl)-2-hydroxy-3-palmitamidobutylphosphonic acid
TypeSmall organic molecule
Emp. Form.C33H52NO6P
Mol. Mass.589.7428
(=O)N[C@@H](Cc1ccc(OCc2ccccc2)cc1)C(=O)CP(O)(O)O