Reaction Details
TargetEctonucleotide pyrophosphatase/phosphodiesterase family member 2
LigandBDBM50332909
Substrate/Competitorn/a
Meas. Tech.ChEMBL_694283 (CHEMBL1637645)
Ki 6200±n/a nM
Citation East, JEKennedy, AJTomsig, JLDe Leon, ARLynch, KRMacdonald, TL Synthesis and structure-activity relationships of tyrosine-based inhibitors of autotaxin (ATX). Bioorg Med Chem Lett20:7132-6 (2010) 
 
Ectonucleotide pyrophosphatase/phosphodiesterase family member 2
Name:Ectonucleotide pyrophosphatase/phosphodiesterase family member 2
Type:Enzyme
Mol. Mass.:99007.13
Organism:Homo sapiens (Human)
Description:Q13822
Residue:863
BDBM50332909
NameBDBM50332909
Synonyms:CHEMBL1632531 anti-(3S)-4-(4-((4-ethoxy-3,5-dimethylpyridin-2-yl)methoxy)phenyl)-2-hydroxy-3-palmitamidobutylphosphonic acid
TypeSmall organic molecule
Emp. Form.C36H59N2O7P
Mol. Mass.662.8366
(=O)N[C@@H](Cc1ccc(OCc2ncc(C)c(OCC)c2C)cc1)C(=O)CP(O)(O)O