Reaction Details
TargetThymidylate kinase
LigandBDBM50332937
Substrate/Competitorn/a
Meas. Tech.ChEMBL_694285 (CHEMBL1637647)
Ki 570±n/a nM
Citation Familiar, OMunier-Lehmann, HAínsa, JACamarasa, MJPérez-Pérez, MJ Design, synthesis and inhibitory activity against Mycobacterium tuberculosis thymidine monophosphate kinase of acyclic nucleoside analogues with a distal imidazoquinolinone. Eur J Med Chem45:5910-8 (2010) 
 
Thymidylate kinase
Name:Thymidylate kinase
Type:PROTEIN
Mol. Mass.:22636.29
Organism:Mycobacterium tuberculosis
Description:ChEMBL_208218
Residue:214
BDBM50332937
NameBDBM50332937
Synonyms:1-[4-(2,2-Dioxo-4,5-dihydro-3H-2lambda-6-thia-1,2a-diaza-acenaphthylen-1-yl)-but-2-enyl]-5-methyl-1H-pyrimidine-2,4-dione | CHEMBL1631398
TypeSmall organic molecule
Emp. Form.C18H20N4O4S
Mol. Mass.388.441
SMILESCc1cn(C\C=C\CN2c3cccc4CCCN(c34)S2(=O)=O)c(=O)[nH]c1=O