Reaction Details
TargetMacrophage metalloelastase
LigandBDBM50332947
Substrate/Competitorn/a
Meas. Tech.ChEMBL_694547 (CHEMBL1635956)
Ki 8±n/a nM
Citation Attolino, ECalderone, VDragoni, EFragai, MRichichi, BLuchinat, CNativi, C Structure-based approach to nanomolar, water soluble matrix metalloproteinases inhibitors (MMPIs). Eur J Med Chem45:5919-25 (2010) 
 
Macrophage metalloelastase
Name:Macrophage metalloelastase
Type:Enzyme
Mol. Mass.:54012.99
Organism:Homo sapiens (Human)
Description:P39900
Residue:470
BDBM50332947
NameBDBM50332947
Synonyms:(S)-2-(N-(2,3-dihydroxypropyl)-4-methoxyphenylsulfonamido)-N-hydroxyacetamide | CHEMBL1632637
TypeSmall organic molecule
Emp. Form.C12H18N2O7S
Mol. Mass.334.346
SMILESCOc1ccc(cc1)S(=O)(=O)N(C[C@H](O)CO)CC(=O)NO