Reaction Details
TargetMetabotropic glutamate receptor 2
LigandBDBM50332968
Substrate/Competitorn/a
Meas. Tech.ChEMBL_696216 (CHEMBL1639369)
IC50 8±n/a nM
Citation Woltering, TJWichmann, JGoetschi, EKnoflach, FBallard, TMHuwyler, JGatti, S Synthesis and characterization of 1,3-dihydro-benzo[b][1,4]diazepin-2-one derivatives: Part 4. In vivo active potent and selective non-competitive metabotropic glutamate receptor 2/3 antagonists. Bioorg Med Chem Lett20:6969-74 (2010) 
 
Metabotropic glutamate receptor 2
Name:Metabotropic glutamate receptor 2
Type:Enzyme
Mol. Mass.:95584.88
Organism:Homo sapiens (Human)
Description:Q14416
Residue:872
BDBM50332968
NameBDBM50332968
Synonyms:7-ethoxy-4-(3-(2-methylpyridin-4-yl)phenyl)-8-(trifluoromethyl)-1H-benzo[b][1,4]diazepin-2(3H)-one | CHEMBL1629866
TypeSmall organic molecule
Emp. Form.C24H20F3N3O2
Mol. Mass.439.4297
SMILESCCOc1cc2N=C(CC(=O)Nc2cc1C(F)(F)F)c1cccc(c1)-c1ccnc(C)c1