Reaction Details
TargetPotassium voltage-gated channel subfamily H member 2
LigandBDBM50417547
Substrate/Competitorn/a
Meas. Tech.ChEMBL_689721 (CHEMBL1635449)
Ki 3981.07±n/a nM
Citation Leslie, CPBiagetti, MBison, SBromidge, SMFabio, RDDonati, DFalchi, AGarnier, MJJaxa-Chamiec, AManchee, GMerlo, GPizzi, DAStasi, LPTibasco, JVong, AWard, SE Discovery of 1-(3-{2-[4-(2-Methyl-5-quinolinyl)-1-piperazinyl]ethyl}phenyl)-2-imidazolidinone (GSK163090), a Potent, Selective, and Orally Active 5-HT1A/B/D Receptor Antagonist J Med Chem53:8228-8240 (2010) 
 
Potassium voltage-gated channel subfamily H member 2
Name:Potassium voltage-gated channel subfamily H member 2
Type:Multi-pass membrane protein
Mol. Mass.:126672.65
Organism:Homo sapiens (Human)
Description:Q12809
Residue:1159
BDBM50417547
NameBDBM50417547
Synonyms:CHEMBL1632206
TypeSmall organic molecule
Emp. Form.C24H28N4O
Mol. Mass.388.5053
SMILESCC(=O)Nc1cccc(CCN2CCN(CC2)c2cccc3nc(C)ccc23)c1