Reaction Details
TargetHistone deacetylase 5
LigandBDBM50333091
Substrate/Competitorn/a
Meas. Tech.ChEMBL_690175 (CHEMBL1634305)
IC50 134±n/a nM
Citation Auzzas, LLarsson, AMatera, RBaraldi, ADeschênes-Simard, BGiannini, GCabri, WBattistuzzi, GGallo, GCiacci, AVesci, LPisano, C Non-Natural Macrocyclic Inhibitors of Histone Deacetylases: Design, Synthesis, and Activity J Med Chem53:8387-8399 (2010) 
 
Histone deacetylase 5
Name:Histone deacetylase 5
Type:Enzyme
Mol. Mass.:121968.61
Organism:Homo sapiens (Human)
Description:Q9UQL6
Residue:1122
BDBM50333091
NameBDBM50333091
Synonyms:(R/S)-N8-hydroxy-2-(4-methoxybenzyloxy)-N1-phenyloctanediamide CHEMBL251011
TypeSmall organic molecule
Emp. Form.C22H28N2O5
Mol. Mass.400.4681
SMILESCOc1ccc(COC(CCCCCC(=O)NO)C(=O)Nc2ccccc2)cc1