Reaction Details
TargetHistone deacetylase 7
LigandBDBM50333090
Substrate/Competitorn/a
Meas. Tech.ChEMBL_690176 (CHEMBL1634306)
IC50 279±n/a nM
Citation Auzzas, LLarsson, AMatera, RBaraldi, ADeschênes-Simard, BGiannini, GCabri, WBattistuzzi, GGallo, GCiacci, AVesci, LPisano, C Non-Natural Macrocyclic Inhibitors of Histone Deacetylases: Design, Synthesis, and Activity J Med Chem53:8387-8399 (2010) 
 
Histone deacetylase 7
Name:Histone deacetylase 7
Type:Chromatin regulator; hydrolase; repressor
Mol. Mass.:102942.62
Organism:Homo sapiens (Human)
Description:Q8WUI4
Residue:952
BDBM50333090
NameBDBM50333090
Synonyms:(R/S)-6-(19-Methoxy-11-oxo-3,13-dioxa-10-azatricyclo[15.3.1.04,9]henicosa-1(21),4(9),5,7,17,19-hexaen-12-yl)hexanoic acid hydroxyamide | CHEMBL1631916
TypeSmall organic molecule
Emp. Form.C25H32N2O6
Mol. Mass.456.5314
SMILESCOc1cc2CCCOC(CCCCCC(=O)NO)C(=O)Nc3ccccc3OCc(c2)c1