Reaction Details
TargetHistone deacetylase 1
LigandBDBM19130
Substrate/Competitorn/a
Meas. Tech.ChEMBL_690170 (CHEMBL1634190)
IC50 7.1±n/a nM
Citation Auzzas, LLarsson, AMatera, RBaraldi, ADeschênes-Simard, BGiannini, GCabri, WBattistuzzi, GGallo, GCiacci, AVesci, LPisano, C Non-Natural Macrocyclic Inhibitors of Histone Deacetylases: Design, Synthesis, and Activity J Med Chem53:8387-8399 (2010) 
 
Histone deacetylase 1
Name:Histone deacetylase 1
Type:Enzyme
Mol. Mass.:55090.27
Organism:Homo sapiens (Human)
Description:Q13547
Residue:482
BDBM19130
NameBDBM19130
Synonyms:(2E,4E,6R)-7-[4-(dimethylamino)phenyl]-N-hydroxy-4,6-dimethyl-7-oxohepta-2,4-dienamide TSA | Trichostatin A (TSA)
TypeSmall organic molecule
Emp. Form.C17H22N2O3
Mol. Mass.302.3682
SMILESCC(C=CC(=O)NO)C=C(C)C(=O)c1ccc(cc1)N(C)C