Reaction Details
TargetHistone deacetylase 1
LigandBDBM19428
Substrate/Competitorn/a
Meas. Tech.ChEMBL_690170 (CHEMBL1634190)
IC50 3.2±n/a nM
Citation Auzzas, LLarsson, AMatera, RBaraldi, ADeschênes-Simard, BGiannini, GCabri, WBattistuzzi, GGallo, GCiacci, AVesci, LPisano, C Non-Natural Macrocyclic Inhibitors of Histone Deacetylases: Design, Synthesis, and Activity J Med Chem53:8387-8399 (2010) 
 
Histone deacetylase 1
Name:Histone deacetylase 1
Type:Enzyme
Mol. Mass.:55090.27
Organism:Homo sapiens (Human)
Description:Q13547
Residue:482
BDBM19428
NameBDBM19428
Synonyms:(2E)-N-hydroxy-3-(4-{[(2-hydroxyethyl)[2-(1H-indol-3-yl)ethyl]amino]methyl}phenyl)prop-2-enamide CHEMBL356066 LAQ-824 | NVP-LAQ824
TypeSmall organic molecule
Emp. Form.C22H25N3O3
Mol. Mass.379.4522
SMILESOCCN(CCc1c[nH]c2ccccc12)Cc1ccc(\C=C\C(=O)NO)cc1