Reaction Details
TargetHistone deacetylase 6
LigandBDBM50333091
Substrate/Competitorn/a
Meas. Tech.ChEMBL_690178 (CHEMBL1634308)
IC50 20±n/a nM
Citation Auzzas, LLarsson, AMatera, RBaraldi, ADeschênes-Simard, BGiannini, GCabri, WBattistuzzi, GGallo, GCiacci, AVesci, LPisano, C Non-Natural Macrocyclic Inhibitors of Histone Deacetylases: Design, Synthesis, and Activity J Med Chem53:8387-8399 (2010) 
 
Histone deacetylase 6
Name:Histone deacetylase 6
Type:Chromatin regulator; hydrolase; repressor
Mol. Mass.:131381.51
Organism:Homo sapiens (Human)
Description:Q9UBN7
Residue:1215
BDBM50333091
NameBDBM50333091
Synonyms:(R/S)-N8-hydroxy-2-(4-methoxybenzyloxy)-N1-phenyloctanediamide CHEMBL251011
TypeSmall organic molecule
Emp. Form.C22H28N2O5
Mol. Mass.400.4681
SMILESCOc1ccc(COC(CCCCCC(=O)NO)C(=O)Nc2ccccc2)cc1