Reaction Details
TargetHistone deacetylase 6
LigandBDBM50333085
Substrate/Competitorn/a
Meas. Tech.ChEMBL_690178 (CHEMBL1634308)
IC50 10±n/a nM
Citation Auzzas, LLarsson, AMatera, RBaraldi, ADeschênes-Simard, BGiannini, GCabri, WBattistuzzi, GGallo, GCiacci, AVesci, LPisano, C Non-Natural Macrocyclic Inhibitors of Histone Deacetylases: Design, Synthesis, and Activity J Med Chem53:8387-8399 (2010) 
 
Histone deacetylase 6
Name:Histone deacetylase 6
Type:Chromatin regulator; hydrolase; repressor
Mol. Mass.:131381.51
Organism:Homo sapiens (Human)
Description:Q9UBN7
Residue:1215
BDBM50333085
NameBDBM50333085
Synonyms:(R/S)-6-(6-Oxo-6,7,10,11,12,13-hexahydro-5H,9H-8,14-dioxa-5-azabenzocyclododecen-7-yl)hexanoic acid hydroxyamide | CHEMBL1631911
TypeSmall organic molecule
Emp. Form.C20H30N2O5
Mol. Mass.378.4626
SMILESONC(=O)CCCCCC1OCCCCCCOc2ccccc2NC1=O