Reaction Details
TargetHistone deacetylase 6
LigandBDBM50333087
Substrate/Competitorn/a
Meas. Tech.ChEMBL_690178 (CHEMBL1634308)
IC50 2±n/a nM
Citation Auzzas, LLarsson, AMatera, RBaraldi, ADeschênes-Simard, BGiannini, GCabri, WBattistuzzi, GGallo, GCiacci, AVesci, LPisano, C Non-Natural Macrocyclic Inhibitors of Histone Deacetylases: Design, Synthesis, and Activity J Med Chem53:8387-8399 (2010) 
 
Histone deacetylase 6
Name:Histone deacetylase 6
Type:Chromatin regulator; hydrolase; repressor
Mol. Mass.:131381.51
Organism:Homo sapiens (Human)
Description:Q9UBN7
Residue:1215
BDBM50333087
NameBDBM50333087
Synonyms:(R/S)-6-(19-Methoxy-11-oxo-3,13-dioxa-10-azatricyclo[15.3.1.04,9]henicosa-1(21),4(9),5,7,15,17,19-heptaen-12-yl)hexanoic acid hydroxyamide | CHEMBL1631913
TypeSmall organic molecule
Emp. Form.C25H30N2O6
Mol. Mass.454.5155
SMILESCOc1cc2COc3ccccc3NC(=O)C(CCCCCC(=O)NO)OC\C=C/c(c2)c1