Reaction Details
TargetHistone deacetylase 6
LigandBDBM50333094
Substrate/Competitorn/a
Meas. Tech.ChEMBL_690178 (CHEMBL1634308)
IC50 3.9±n/a nM
Citation Auzzas, LLarsson, AMatera, RBaraldi, ADeschênes-Simard, BGiannini, GCabri, WBattistuzzi, GGallo, GCiacci, AVesci, LPisano, C Non-Natural Macrocyclic Inhibitors of Histone Deacetylases: Design, Synthesis, and Activity J Med Chem53:8387-8399 (2010) 
 
Histone deacetylase 6
Name:Histone deacetylase 6
Type:Chromatin regulator; hydrolase; repressor
Mol. Mass.:131381.51
Organism:Homo sapiens (Human)
Description:Q9UBN7
Residue:1215
BDBM50333094
NameBDBM50333094
Synonyms:(R)-6-(19-Methoxy-11-oxo-3,13-dioxa-10-azatricyclo[15.3.1.04,9]henicosa-1(21),4(9),5,7,17,19-hexaen-12-yl)hexanoic acid hydroxyamide | CHEMBL1631918
TypeSmall organic molecule
Emp. Form.C25H32N2O6
Mol. Mass.456.5314
SMILESCOc1cc2CCCO[C@H](CCCCCC(=O)NO)C(=O)Nc3ccccc3OCc(c2)c1