Reaction Details
TargetGlutamate receptor 2
LigandBDBM50027828
Substrate/Competitorn/a
Meas. Tech.ChEMBL_690224 (CHEMBL1634493)
Ki 108±n/a nM
Citation Frydenvang, KPickering, DSGreenwood, JRKrogsgaard-Larsen, NBrehm, LNielsen, BVogensen, SBHald, HKastrup, JSKrogsgaard-Larsen, P Biostructural and Pharmacological Studies of Bicyclic Analogues of the 3-Isoxazolol Glutamate Receptor Agonist Ibotenic Acid J Med Chem53:8354-8361 (2010) 
 
Glutamate receptor 2
Name:Glutamate receptor 2
Type:Enzyme Catalytic Domain
Mol. Mass.:98825.96
Organism:Homo sapiens (Human)
Description:Glutamate AMPA 2 GRIA2 HUMAN::P42262
Residue:883
BDBM50027828
NameBDBM50027828
Synonyms:(7S)-3-hydroxy-4,5,6,7-tetrahydroisoxazolo[5,4-c]pyridine-7-carboxylic acid CHEMBL154535
TypeSmall organic molecule
Emp. Form.C7H8N2O4
Mol. Mass.184.1494
SMILES[O-]C(=O)C1[NH2+]CCc2c1o[nH]c2=O