Reaction Details
TargetMethionine--tRNA ligase
LigandBDBM50333116
Substrate/Competitorn/a
Meas. Tech.ChEMBL_693526 (CHEMBL1637421)
Ki 225±n/a nM
Citation Green, LSBullard, JMRibble, WDean, FAyers, DFOchsner, UAJanjic, NJarvis, TC Inhibition of methionyl-tRNA synthetase by REP8839 and effects of resistance mutations on enzyme activity. Antimicrob Agents Chemother53:86-94 (2008) 
 
Methionine--tRNA ligase
Name:Methionine--tRNA ligase
Type:PROTEIN
Mol. Mass.:77016.12
Organism:Haemophilus influenzae (strain ATCC 51907 / DSM 11121 / KW20 / Rd)
Description:ChEMBL_693526
Residue:682
BDBM50333116
NameBDBM50333116
Synonyms:2-(3-((4-bromo-5-(1-fluorovinyl)-3-methylthiophen-2-yl)methylamino)propylamino)quinolin-4(1H)-one | CHEMBL1631216
TypeSmall organic molecule
Emp. Form.C20H21BrFN3OS
Mol. Mass.450.368
SMILESCc1c(Br)c(sc1CNCCCNc1cc(O)c2ccccc2n1)C(F)=C