Reaction Details
TargetCytochrome P450 2C9
LigandBDBM50333117
Substrate/Competitorn/a
Meas. Tech.ChEMBL_690377 (CHEMBL1634994)
Ki 2800±n/a nM
Citation Jeong, SNguyen, PDDesta, Z Comprehensive in vitro analysis of voriconazole inhibition of eight cytochrome P450 (CYP) enzymes: major effect on CYPs 2B6, 2C9, 2C19, and 3A. Antimicrob Agents Chemother53:541-51 (2009) 
 
Cytochrome P450 2C9
Name:Cytochrome P450 2C9
Type:Enzyme
Mol. Mass.:55636.33
Organism:Homo sapiens (Human)
Description:P11712
Residue:490
BDBM50333117
NameBDBM50333117
Synonyms:(2R,3S)-2,3-bis(2,4-difluorophenyl)-1-(1H-1,2,4-triazol-1-yl)butan-2-ol (2R,3S)-2-(2,4-difluorophenyl)-3-(5-fluoropyrimidin-4-yl)-1-(1H-1,2,4-triazol-1-yl)butan-2-ol UK-109496 US9221791, Voriconazole Vfend
TypeSmall organic molecule
Emp. Form.C16H14F3N5O
Mol. Mass.349.3105
SMILESC[C@@H](c1ncncc1F)[C@](O)(Cn1cncn1)c1ccc(F)cc1F