Reaction Details
TargetBeta-lactamase
LigandBDBM50022788
Substrate/Competitorn/a
Meas. Tech.ChEMBL_693673 (CHEMBL1637941)
IC50 4±n/a nM
Citation Zioga, AWhichard, JMKotsakis, SDTzouvelekis, LSTzelepi, EMiriagou, V CMY-31 and CMY-36 cephalosporinases encoded by ColE1-like plasmids. Antimicrob Agents Chemother53:1256-9 (2009) 
 
Beta-lactamase
Name:Beta-lactamase
Type:PROTEIN
Mol. Mass.:42045.45
Organism:Klebsiella pneumoniae
Description:ChEMBL_693673
Residue:381
BDBM50022788
NameBDBM50022788
Synonyms:(2S,5R,6R)-6-(3-(2-chlorophenyl)-5-methylisoxazole-4-carboxamido)-3,3-dimethyl-7-oxo-4-thia-1-aza-bicyclo[3.2.0]heptane-2-carboxylic acid 6-{[3-(2-Chloro-phenyl)-5-methyl-isoxazole-4-carbonyl]-amino}-3,3-dimethyl-7-oxo-4-thia-1-aza-bicyclo[3.2.0]heptane-2-carboxylic acid CLOXAPEN cloxacillin
TypeSmall organic molecule
Emp. Form.C19H18ClN3O5S
Mol. Mass.435.881
SMILESCc1onc(c1C(=O)N[C@H]1[C@H]2SC(C)(C)[C@@H](N2C1=O)C(O)=O)-c1ccccc1Cl