Reaction Details
TargetBeta-lactamase
LigandBDBM50053184
Substrate/Competitorn/a
Meas. Tech.ChEMBL_693673 (CHEMBL1637941)
IC50 300±n/a nM
Citation Zioga, AWhichard, JMKotsakis, SDTzouvelekis, LSTzelepi, EMiriagou, V CMY-31 and CMY-36 cephalosporinases encoded by ColE1-like plasmids. Antimicrob Agents Chemother53:1256-9 (2009) 
 
Beta-lactamase
Name:Beta-lactamase
Type:PROTEIN
Mol. Mass.:42045.45
Organism:Klebsiella pneumoniae
Description:ChEMBL_693673
Residue:381
BDBM50053184
NameBDBM50053184
Synonyms:(2S,3S,5R)-3-((Z)-2-Cyano-vinyl)-3-methyl-4,4,7-trioxo-4lambda*6*-thia-1-aza-bicyclo[3.2.0]heptane-2-carboxylic acid CHEMBL333078
TypeSmall organic molecule
Emp. Form.C10H10N2O5S
Mol. Mass.270.262
SMILESC[C@]1(\C=C/C#N)[C@@H](N2[C@@H](CC2=O)S1(=O)=O)C(O)=O