Reaction Details
TargetBeta-lactamase
LigandBDBM50021959
Substrate/Competitorn/a
Meas. Tech.ChEMBL_696792 (CHEMBL1639005)
Ki 11000±n/a nM
Citation Papp-Wallace, KMTaracila, MHornick, JMHujer, AMHujer, KMDistler, AMEndimiani, ABonomo, RA Substrate selectivity and a novel role in inhibitor discrimination by residue 237 in the KPC-2 beta-lactamase. Antimicrob Agents Chemother54:2867-77 (2010) 
 
Beta-lactamase
Name:Beta-lactamase
Synonyms:Class A carbapenemase KPC-2
Type:PROTEIN
Mol. Mass.:31116.99
Organism:Escherichia coli
Description:ChEMBL_696792
Residue:293
BDBM50021959
NameBDBM50021959
TypeSmall organic molecule
Emp. Form.C8H9NO5
Mol. Mass.199.1608
SMILESOC\C=C1/O[C@@H]2CC(=O)N2[C@H]1C(O)=O