Reaction Details
TargetXanthine dehydrogenase/oxidase
LigandBDBM35440
Substrate/Competitorn/a
Meas. Tech.ChEMBL_701315 (CHEMBL1648935)
IC50 730±n/a nM
Citation Sathisha, KRKhanum, SAChandra, JNAyisha, FBalaji, SMarathe, GKGopal, SRangappa, KS Synthesis and xanthine oxidase inhibitory activity of 7-methyl-2-(phenoxymethyl)-5H-[1,3,4]thiadiazolo[3,2-a]pyrimidin-5-one derivatives. Bioorg Med Chem19:211-20 (2011) 
 
Xanthine dehydrogenase/oxidase
Name:Xanthine dehydrogenase/oxidase
Type:Protein
Mol. Mass.:146809.00
Organism:Bos taurus (Bovine)
Description:P80457
Residue:1332
BDBM35440
NameBDBM35440
Synonyms:ALLOPURINOL SMR000059083 | cid_2094
TypeSmall organic molecule
Emp. Form.C5H4N4O
Mol. Mass.136.1115
SMILESO=c1[nH]cnc2n[nH]cc12