Reaction Details
TargetAcetylcholinesterase
LigandBDBM50333151
Substrate/Competitorn/a
Meas. Tech.ChEMBL_701317 (CHEMBL1648937)
IC50 30±n/a nM
Citation Samadi, AValderas, Cde los Ríos, CBastida, AChioua, MGonzález-Lafuente, LColmena, IGandía, LRomero, ADel Barrio, LMartín-de-Saavedra, MDLópez, MGVillarroya, MMarco-Contelles, J Cholinergic and neuroprotective drugs for the treatment of Alzheimer and neuronal vascular diseases. II. Synthesis, biological assessment, and molecular modelling of new tacrine analogues from highly substituted 2-aminopyridine-3-carbonitriles. Bioorg Med Chem19:122-33 (2011) 
 
Acetylcholinesterase
Name:Acetylcholinesterase
Type:Enzyme
Mol. Mass.:71812.79
Organism:Electrophorus electricus (Electric eel)
Description:n/a
Residue:633
BDBM50333151
NameBDBM50333151
Synonyms:5-Amino-2-(prop-2-yn-1-ylamino)-6,7,8,9-tetrahydrobenzo[1,8-b]-naphthyridine-3-carbonitrile | CHEMBL1644724
TypeSmall organic molecule
Emp. Form.C16H15N5
Mol. Mass.277.3238
SMILESNc1c2CCCCc2nc2nc(NCC#C)c(cc12)C#N