Reaction Details
TargetCholinesterase
LigandBDBM50333148
Substrate/Competitorn/a
Meas. Tech.ChEMBL_701319 (CHEMBL1648939)
IC50 5200±n/a nM
Citation Samadi, AValderas, Cde los Ríos, CBastida, AChioua, MGonzález-Lafuente, LColmena, IGandía, LRomero, ADel Barrio, LMartín-de-Saavedra, MDLópez, MGVillarroya, MMarco-Contelles, J Cholinergic and neuroprotective drugs for the treatment of Alzheimer and neuronal vascular diseases. II. Synthesis, biological assessment, and molecular modelling of new tacrine analogues from highly substituted 2-aminopyridine-3-carbonitriles. Bioorg Med Chem19:122-33 (2011) 
 
Cholinesterase
Name:Cholinesterase
Type:Enzyme
Mol. Mass.:65643.35
Organism:Equus caballus (Horse)
Description:P81908
Residue:574
BDBM50333148
NameBDBM50333148
Synonyms:5-Amino-2-(dimethylamino)-6,7,8,9-tetrahydrobenzo[1,8-b]-naphthyridine-3-carbonitrile | CHEMBL1644721
TypeSmall organic molecule
Emp. Form.C15H17N5
Mol. Mass.267.329
SMILESCN(C)c1nc2nc3CCCCc3c(N)c2cc1C#N