Reaction Details
TargetCholinesterase
LigandBDBM50333155
Substrate/Competitorn/a
Meas. Tech.ChEMBL_701319 (CHEMBL1648939)
IC50 5100±n/a nM
Citation Samadi, AValderas, Cde los Ríos, CBastida, AChioua, MGonzález-Lafuente, LColmena, IGandía, LRomero, ADel Barrio, LMartín-de-Saavedra, MDLópez, MGVillarroya, MMarco-Contelles, J Cholinergic and neuroprotective drugs for the treatment of Alzheimer and neuronal vascular diseases. II. Synthesis, biological assessment, and molecular modelling of new tacrine analogues from highly substituted 2-aminopyridine-3-carbonitriles. Bioorg Med Chem19:122-33 (2011) 
 
Cholinesterase
Name:Cholinesterase
Type:Enzyme
Mol. Mass.:65643.35
Organism:Equus caballus (Horse)
Description:P81908
Residue:574
BDBM50333155
NameBDBM50333155
Synonyms:5-Amino-2-methoxy-4-phenyl-6,7,8,9-tetrahydrobenzo[1,8-b]-naphthyridine-3-carbonitrile | CHEMBL1644728
TypeSmall organic molecule
Emp. Form.C20H18N4O
Mol. Mass.330.3831
SMILESCOc1nc2nc3CCCCc3c(N)c2c(-c2ccccc2)c1C#N