Reaction Details
TargetDeoxyribonuclease gamma
LigandBDBM50206432
Substrate/Competitorn/a
Meas. Tech.ChEMBL_698121 (CHEMBL1646041)
IC50 3200±n/a nM
Citation Yamada, YFujii, TIshijima, RTachibana, HYokoue, NTakasawa, RTanuma, S DR396, an apoptotic DNase¿ inhibitor, attenuates high mobility group box 1 release from apoptotic cells. Bioorg Med Chem19:168-71 (2011) 
 
Deoxyribonuclease gamma
Name:Deoxyribonuclease gamma
Type:PROTEIN
Mol. Mass.:35519.06
Organism:Homo sapiens (Human)
Description:ChEMBL_1457551
Residue:305
BDBM50206432
NameBDBM50206432
Synonyms:4-(4,6-dichloro-1,3,5-triazin-2-ylamino)-2-(6-hydroxy-3-oxo-3H-xanthen-9-yl)benzoic acid | CHEMBL222509
TypeSmall organic molecule
Emp. Form.C23H12Cl2N4O5
Mol. Mass.495.271
SMILESOC(=O)c1ccc(Nc2nc(Cl)nc(Cl)n2)cc1-c1c2ccc(O)cc2oc2cc(=O)ccc12