Reaction Details
TargetAmine oxidase [flavin-containing] A
LigandBDBM50333414
Substrate/Competitorn/a
Meas. Tech.ChEMBL_698696 (CHEMBL1648260)
Ki 5±n/a nM
Citation Reniers, JRobert, SFrederick, RMasereel, BVincent, SWouters, J Synthesis and evaluation ofß-carboline derivatives as potential monoamine oxidase inhibitors. Bioorg Med Chem19:134-44 (2011) 
 
Amine oxidase [flavin-containing] A
Name:Amine oxidase [flavin-containing] A
Type:Protein
Mol. Mass.:59689.53
Organism:Homo sapiens (Human)
Description:P21397
Residue:527
BDBM50333414
NameBDBM50333414
Synonyms:7-(Allyloxy)-1-methyl-beta-carboline | CHEMBL1645544
TypeSmall organic molecule
Emp. Form.C15H14N2O
Mol. Mass.238.2845
SMILESCc1nccc2c3ccc(OCC=C)cc3[nH]c12