Reaction Details
TargetAmine oxidase [flavin-containing] A
LigandBDBM50333418
Substrate/Competitorn/a
Meas. Tech.ChEMBL_698696 (CHEMBL1648260)
Ki 3.6±n/a nM
Citation Reniers, JRobert, SFrederick, RMasereel, BVincent, SWouters, J Synthesis and evaluation ofß-carboline derivatives as potential monoamine oxidase inhibitors. Bioorg Med Chem19:134-44 (2011) 
 
Amine oxidase [flavin-containing] A
Name:Amine oxidase [flavin-containing] A
Type:Protein
Mol. Mass.:59689.53
Organism:Homo sapiens (Human)
Description:P21397
Residue:527
BDBM50333418
NameBDBM50333418
Synonyms:7-(4,4,4-Trifluorobutoxy)-1-methyl-beta-carboline | CHEMBL1645547
TypeSmall organic molecule
Emp. Form.C16H15F3N2O
Mol. Mass.308.2983
SMILESCc1nccc2c3ccc(OCCCC(F)(F)F)cc3[nH]c12