Reaction Details
TargetAmine oxidase [flavin-containing] A
LigandBDBM50333424
Substrate/Competitorn/a
Meas. Tech.ChEMBL_698696 (CHEMBL1648260)
Ki 35±n/a nM
Citation Reniers, JRobert, SFrederick, RMasereel, BVincent, SWouters, J Synthesis and evaluation ofß-carboline derivatives as potential monoamine oxidase inhibitors. Bioorg Med Chem19:134-44 (2011) 
 
Amine oxidase [flavin-containing] A
Name:Amine oxidase [flavin-containing] A
Type:Protein
Mol. Mass.:59689.53
Organism:Homo sapiens (Human)
Description:P21397
Residue:527
BDBM50333424
NameBDBM50333424
Synonyms:7-(Pyridin-4-ylmethoxy)-1-methyl-beta-carboline | CHEMBL1645553
TypeSmall organic molecule
Emp. Form.C18H15N3O
Mol. Mass.289.3312
SMILESCc1nccc2c3ccc(OCc4ccncc4)cc3[nH]c12