Reaction Details
TargetAmine oxidase [flavin-containing] A
LigandBDBM50333426
Substrate/Competitorn/a
Meas. Tech.ChEMBL_698696 (CHEMBL1648260)
Ki 1024±n/a nM
Citation Reniers, JRobert, SFrederick, RMasereel, BVincent, SWouters, J Synthesis and evaluation ofß-carboline derivatives as potential monoamine oxidase inhibitors. Bioorg Med Chem19:134-44 (2011) 
 
Amine oxidase [flavin-containing] A
Name:Amine oxidase [flavin-containing] A
Type:Protein
Mol. Mass.:59689.53
Organism:Homo sapiens (Human)
Description:P21397
Residue:527
BDBM50333426
NameBDBM50333426
Synonyms:7-(N,N-Dimethylaminoethyloxy)-1-methyl-beta-carboline | CHEMBL1645555
TypeSmall organic molecule
Emp. Form.C16H19N3O
Mol. Mass.269.3416
SMILESCN(C)CCOc1ccc2c(c1)[nH]c1c(C)nccc21