Reaction Details
Target5-hydroxytryptamine receptor 1A
LigandBDBM50309519
Substrate/Competitorn/a
Meas. Tech.ChEMBL_698908 (CHEMBL1645848)
Ki 11±n/a nM
Citation Pettersson, MCampbell, BMDounay, ABGray, DLXie, LO'Donnell, CJStratman, NCZoski, KDrummond, EBora, GProbert, AWhisman, T Design, synthesis, and pharmacological evaluation of azetedine and pyrrolidine derivatives as dual norepinephrine reuptake inhibitors and 5-HT(1A) partial agonists. Bioorg Med Chem Lett21:865-8 (2011) 
 
5-hydroxytryptamine receptor 1A
Name:5-hydroxytryptamine receptor 1A
Type:n/a
Mol. Mass.:46122.49
Organism:Homo sapiens (Human)
Description:n/a
Residue:422
BDBM50309519
NameBDBM50309519
Synonyms:2-(2-chloro-6-fluorophenoxy)-3-(piperidin-4-yl)pyridine | CHEMBL597134
TypeSmall organic molecule
Emp. Form.C16H16ClFN2O
Mol. Mass.306.762
SMILESFc1cccc(Cl)c1Oc1ncccc1C1CCNCC1