Reaction Details
Target5-hydroxytryptamine receptor 1A
LigandBDBM50333432
Substrate/Competitorn/a
Meas. Tech.ChEMBL_698908 (CHEMBL1645848)
Ki 14±n/a nM
Citation Pettersson, MCampbell, BMDounay, ABGray, DLXie, LO'Donnell, CJStratman, NCZoski, KDrummond, EBora, GProbert, AWhisman, T Design, synthesis, and pharmacological evaluation of azetedine and pyrrolidine derivatives as dual norepinephrine reuptake inhibitors and 5-HT(1A) partial agonists. Bioorg Med Chem Lett21:865-8 (2011) 
 
5-hydroxytryptamine receptor 1A
Name:5-hydroxytryptamine receptor 1A
Type:n/a
Mol. Mass.:46122.49
Organism:Homo sapiens (Human)
Description:n/a
Residue:422
BDBM50333432
NameBDBM50333432
Synonyms:3-(2-(2-chlorophenoxy)-6-fluorophenoxy)azetidine | CHEMBL1645599
TypeSmall organic molecule
Emp. Form.C15H13ClFNO2
Mol. Mass.293.721
SMILESFc1cccc(Oc2ccccc2Cl)c1OC1CNC1