Reaction Details
TargetProstaglandin D2 receptor 2
LigandBDBM50333503
Substrate/Competitorn/a
Meas. Tech.ChEMBL_699224 (CHEMBL1646946)
Ki 12±n/a nM
Citation Simard, DLeblanc, YBerthelette, CZaghdane, MHMolinaro, CWang, ZGallant, MLau, SThao, THamel, MStocco, RSawyer, NSillaots, SGervais, FHoule, RLévesque, JF Azaindoles as potent CRTH2 receptor antagonists. Bioorg Med Chem Lett21:841-5 (2011) 
 
Prostaglandin D2 receptor 2
Name:Prostaglandin D2 receptor 2
Type:Enzyme
Mol. Mass.:43295.45
Organism:Homo sapiens (Human)
Description:Q9Y5Y4
Residue:395
BDBM50333503
NameBDBM50333503
Synonyms:(R)-2-(8-(4-(4-fluorophenyl)-N-methyltetrahydro-2H-pyran-4-carboxamido)-6,7,8,9-tetrahydropyrido[3,2-b]indolizin-5-yl)acetic acid | CHEMBL1641818
TypeSmall organic molecule
Emp. Form.C26H28FN3O4
Mol. Mass.465.5166
SMILESCN([C@@H]1CCc2c(CC(O)=O)c3cccnc3n2C1)C(=O)C1(CCOCC1)c1ccc(F)cc1