Reaction Details
TargetPotassium voltage-gated channel subfamily H member 2
LigandBDBM50333594
Substrate/Competitorn/a
Meas. Tech.ChEMBL_699750 (CHEMBL1648563)
IC50 0.67±n/a nM
Citation Haga, YMizutani, SNaya, AKishino, HIwaasa, HIto, MIto, JMoriya, MSato, NTakenaga, NIshihara, ATokita, SKanatani, AOhtake, N Discovery of novel phenylpyridone derivatives as potent and selective MCH1R antagonists. Bioorg Med Chem19:883-93 (2011) 
 
Potassium voltage-gated channel subfamily H member 2
Name:Potassium voltage-gated channel subfamily H member 2
Type:Multi-pass membrane protein
Mol. Mass.:126672.65
Organism:Homo sapiens (Human)
Description:Q12809
Residue:1159
BDBM50333594
NameBDBM50333594
Synonyms:4-(Naphthalen-2-ylmethoxy)-1-{4-[2-(pyrrolidin-1-yl)-ethoxy]phenyl}pyridin-2(1H)-one | CHEMBL1642479
TypeSmall organic molecule
Emp. Form.C28H28N2O3
Mol. Mass.440.5335
SMILESO=c1cc(OCc2ccc3ccccc3c2)ccn1-c1ccc(OCCN2CCCC2)cc1